GPU includes not found

classic Classic list List threaded Threaded
11 messages Options
Reply | Threaded
Open this post in threaded view
|

GPU includes not found

nigellima
Hi, everyone.

I'm trying to run the example that is in the folder
pcl/gpu/people/tools/people_pcd_prob.cpp, which basically gets a pcd file as
in input and uses people detector to find the human keypoints.
I've installed PCL in Windows 10 using the all-in-one installer of the
version 1.8. The, I built a Visual Studio 2015 project using Cmake.
All the includes seem to be recognized by the IDE (io, image_viewer, etc).
But the ones: <pcl/gpu/people/colormap.h> and
<pcl/gpu/people/people_detector.h> are not been found and, as a result, all
of their the functions are undefined.

What changes were made in the 1.8 version that I should be awere of to make
the PeopleDecetor work? Or should I downgrade to version 1.7?

I appreciate any help. Thanks in advance



--
Sent from: http://www.pcl-users.org/
_______________________________________________
[hidden email] / http://pointclouds.org
http://pointclouds.org/mailman/listinfo/pcl-users
Reply | Threaded
Open this post in threaded view
|

Re: GPU includes not found

Goldesel

In order to have the gpu includes you should install cuda and build pcl from source. The all in one installer does not include some modules by default.


On Qui, 28 de set de 2017, 00:32 nigellima <[hidden email]> wrote:
Hi, everyone.

I'm trying to run the example that is in the folder
pcl/gpu/people/tools/people_pcd_prob.cpp, which basically gets a pcd file as
in input and uses people detector to find the human keypoints.
I've installed PCL in Windows 10 using the all-in-one installer of the
version 1.8. The, I built a Visual Studio 2015 project using Cmake.
All the includes seem to be recognized by the IDE (io, image_viewer, etc).
But the ones: <pcl/gpu/people/colormap.h> and
<pcl/gpu/people/people_detector.h> are not been found and, as a result, all
of their the functions are undefined.

What changes were made in the 1.8 version that I should be awere of to make
the PeopleDecetor work? Or should I downgrade to version 1.7?

I appreciate any help. Thanks in advance



--
Sent from: http://www.pcl-users.org/
_______________________________________________
[hidden email] / http://pointclouds.org
http://pointclouds.org/mailman/listinfo/pcl-users

_______________________________________________
[hidden email] / http://pointclouds.org
http://pointclouds.org/mailman/listinfo/pcl-users
Reply | Threaded
Open this post in threaded view
|

Re: GPU includes not found

nigellima
Thanks, Goldesel.

I followed your advice and could generate the project using cmake for Visual
Studio Enterpreise 2015, withour any errors. But, when I try to follow the
tutorial on the part of building the ALL_BUILD project, 163 are thrown. Is
this a problem with my IDE version?



--
Sent from: http://www.pcl-users.org/
_______________________________________________
[hidden email] / http://pointclouds.org
http://pointclouds.org/mailman/listinfo/pcl-users
Reply | Threaded
Open this post in threaded view
|

Re: GPU includes not found

Goldesel
What type of errors do you have? Notice you need to build other dependencies first, namely VTK, BOOST, EIGEN, CUDA, and FLANN. 

Can you show what type of errors you are getting? 

Em seg, 2 de out de 2017 às 16:43, nigellima <[hidden email]> escreveu:
Thanks, Goldesel.

I followed your advice and could generate the project using cmake for Visual
Studio Enterpreise 2015, withour any errors. But, when I try to follow the
tutorial on the part of building the ALL_BUILD project, 163 are thrown. Is
this a problem with my IDE version?



--
Sent from: http://www.pcl-users.org/
_______________________________________________
[hidden email] / http://pointclouds.org
http://pointclouds.org/mailman/listinfo/pcl-users

_______________________________________________
[hidden email] / http://pointclouds.org
http://pointclouds.org/mailman/listinfo/pcl-users
Reply | Threaded
Open this post in threaded view
|

Re: GPU includes not found

nigellima
This post was updated on .
All the other dependencies I've installed, and when I "configured" CMAKE
found all of them.

The errors are like:

Severity Code Description Project File Line Suppression State
Error LNK2019 unresolved external symbol "class
boost::system::error_category const & __cdecl
boost::system::system_category(void)"
(?system_category@system@boost@@YAAEBVerror_category@12@XZ) referenced in
function "public: __cdecl boost::thread_exception::thread_exception(int,char
const *)" (??0thread_exception@boost@@QEAA@HPEBD@Z) pcl_io_ply
C:\PCL\pcl-master\build\io\ply_parser.obj

Severity Code Description Project File Line Suppression State
Error LNK1120 2 unresolved externals pcl_io_ply
C:\PCL\pcl-master\build\bin\pcl_io_ply_debug.dll

Severity Code Description Project File Line Suppression State
Error LNK2019 unresolved external symbol "public: __cdecl
boost::thread::thread(void)" (??0thread@boost@@QEAA@XZ) referenced in
function "public: __cdecl pcl::TimeTrigger::TimeTrigger(double,class
boost::function<void __cdecl(void)> const &)"
(??0TimeTrigger@pcl@@QEAA@NAEBV?$function@$$A6AXXZ@boost@@@Z) pcl_common
C:\PCL\pcl-master\build\common\time_trigger.obj 1


Severity Code Description Project File Line Suppression State
Error C1189 #error:  Xiron Platform Abstraction Layer - Win32 - Microsoft
Visual Studio versions above 2010 (10.0) are not supported! pcl_io
c:\program files\openni\include\XnPlatform.h 58


Severity Code Description Project File Line Suppression State
Error C2065 'ssize_t': undeclared identifier pcl_io
C:\PCL\pcl-master\io\src\pcd_io.cpp 765


Severity Code Description Project File Line Suppression State
Error C2146 syntax error: missing ';' before identifier 'num_read' pcl_io
C:\PCL\pcl-master\io\src\pcd_io.cpp 765


Severity Code Description Project File Line Suppression State
Error C1189 #error:  Xiron Platform Abstraction Layer - Win32 - Microsoft
Visual Studio versions above 2010 (10.0) are not supported! pcl_io
c:\program files\openni\include\XnPlatform.h 58


Severity Code Description Project File Line Suppression State
Error C2280 'Eigen::Block<Derived,-1,-1,false,true>
&Eigen::Block<Derived,-1,-1,false,true>::operator =(const
Eigen::Block<Derived,-1,-1,false,true> &)': attempting to reference a
deleted function pcl_gpu_kinfu c:\program files
(x86)\eigen\include\eigen\src\Core\SolveTriangular.h 194


Severity Code Description Project File Line Suppression State
Error MSB8020 The build tools for v141 (Platform Toolset = 'v141') cannot be
found. To build using the v141 build tools, please install v141 build tools.
Alternatively, you may upgrade to the current Visual Studio tools by
selecting the Project menu or right-click the solution, and then selecting
"Retarget solution". pcl_voxel_grid_occlusion_estimation C:\Program Files
(x86)\MSBuild\Microsoft.Cpp\v4.0\V140\Microsoft.Cpp.Platform.targets 57


I dont know why this last one is showing up. Because I selected all the
projects and set up Platform Toolset to "v141 build tools"




--
Sent from: http://www.pcl-users.org/
_______________________________________________
PCL-users@pointclouds.org / http://pointclouds.org
http://pointclouds.org/mailman/listinfo/pcl-users
Reply | Threaded
Open this post in threaded view
|

Re: GPU includes not found

Goldesel
I think he's not detecting the correct build tools. See if this helps:


Em seg, 2 de out de 2017 às 16:56, nigellima <[hidden email]> escreveu:
All the other dependencies I've installed, and when I "configured" CMAKE
found all of them.

The errors are like:

Severity        Code    Description     Project File    Line    Suppression State
Error   LNK2019 unresolved external symbol "class
boost::system::error_category const & __cdecl
boost::system::system_category(void)"
(?system_category@system@boost@@YAAEBVerror_category@12@XZ) referenced in
function "public: __cdecl boost::thread_exception::thread_exception(int,char
const *)" (??0thread_exception@boost@@QEAA@HPEBD@Z)     pcl_io_ply
C:\PCL\pcl-master\build\io\ply_parser.obj

Severity        Code    Description     Project File    Line    Suppression State
Error   LNK1120 2 unresolved externals  pcl_io_ply
C:\PCL\pcl-master\build\bin\pcl_io_ply_debug.dll

Severity        Code    Description     Project File    Line    Suppression State
Error   LNK2019 unresolved external symbol "public: __cdecl
boost::thread::thread(void)" (??0thread@boost@@QEAA@XZ) referenced in
function "public: __cdecl pcl::TimeTrigger::TimeTrigger(double,class
boost::function<void __cdecl(void)> const &)"
(??0TimeTrigger@pcl@@QEAA@NAEBV?$function@$$A6AXXZ@boost@@@Z)   pcl_common
C:\PCL\pcl-master\build\common\time_trigger.obj 1


Severity        Code    Description     Project File    Line    Suppression State
Error   C1189   #error:  Xiron Platform Abstraction Layer - Win32 - Microsoft
Visual Studio versions above 2010 (10.0) are not supported!     pcl_io
c:\program files\openni\include\XnPlatform.h    58


Severity        Code    Description     Project File    Line    Suppression State
Error   C2065   'ssize_t': undeclared identifier        pcl_io
C:\PCL\pcl-master\io\src\pcd_io.cpp     765


Severity        Code    Description     Project File    Line    Suppression State
Error   C2146   syntax error: missing ';' before identifier 'num_read'  pcl_io
C:\PCL\pcl-master\io\src\pcd_io.cpp     765


Severity        Code    Description     Project File    Line    Suppression State
Error   C1189   #error:  Xiron Platform Abstraction Layer - Win32 - Microsoft
Visual Studio versions above 2010 (10.0) are not supported!     pcl_io
c:\program files\openni\include\XnPlatform.h    58


Severity        Code    Description     Project File    Line    Suppression State
Error   C2280   'Eigen::Block<Derived,-1,-1,false,true>
&Eigen::Block<Derived,-1,-1,false,true>::operator =(const
Eigen::Block<Derived,-1,-1,false,true> &)': attempting to reference a
deleted function        pcl_gpu_kinfu   c:\program files
(x86)\eigen\include\eigen\src\Core\SolveTriangular.h    194


Severity        Code    Description     Project File    Line    Suppression State
Error   MSB8020 The build tools for v141 (Platform Toolset = 'v141') cannot be
found. To build using the v141 build tools, please install v141 build tools.
Alternatively, you may upgrade to the current Visual Studio tools by
selecting the Project menu or right-click the solution, and then selecting
"Retarget solution".    pcl_voxel_grid_occlusion_estimation     C:\Program Files
(x86)\MSBuild\Microsoft.Cpp\v4.0\V140\Microsoft.Cpp.Platform.targets    57


I dont know whay this last one is showing up. Because I selected all the
projects and set up Platform Toolset to "v141 build tools"




--
Sent from: http://www.pcl-users.org/
_______________________________________________
[hidden email] / http://pointclouds.org
http://pointclouds.org/mailman/listinfo/pcl-users

_______________________________________________
[hidden email] / http://pointclouds.org
http://pointclouds.org/mailman/listinfo/pcl-users
Reply | Threaded
Open this post in threaded view
|

Re: GPU includes not found

nigellima
This post was updated on .
Thank you very much, Goldesel.

I checked your link and they said that the v141 tools are wouldnt work in VS
2015. So, I tried building the project in VS 2017, which has the actual v141
build tools.

At the end, the message shown was:

 Build: 11 successful, 127 failed, 0 updated, 0 ignored.

The errors now are slightly differente. Now it is like:

- LINK : fatal error LNK1104: it was not possible to open the file
'..\lib\pcl_recognition_debug.lib'

- implicit_shape_model.cpp
118>Unknown compiler version - please run the configure tests and report the
results

Any idea of what could it be?



--
Sent from: http://www.pcl-users.org/
_______________________________________________
PCL-users@pointclouds.org / http://pointclouds.org
http://pointclouds.org/mailman/listinfo/pcl-users
Reply | Threaded
Open this post in threaded view
|

Re: GPU includes not found

nigellima
This post was updated on .
In reply to this post by Goldesel
Now I tested on Release mode in Visual Studio 2017 and all the errors happen to be the same as I
listed. Could it actually be a problem with the IDE version?

Severity Code Description Project File Line Suppression State
Error LNK2019 unresolved external symbol "class
boost::system::error_category const & __cdecl
boost::system::system_category(void)"
(?system_category@system@boost@@YAAEBVerror_category@12@XZ) referenced in
function "public: __cdecl boost::thread_exception::thread_exception(int,char
const *)" (??0thread_exception@boost@@QEAA@HPEBD@Z) pcl_io_ply
C:\PCL\pcl-master\build\io\ply_parser.obj

Severity Code Description Project File Line Suppression State
Error LNK1120 2 unresolved externals pcl_io_ply
C:\PCL\pcl-master\build\bin\pcl_io_ply_debug.dll

Severity Code Description Project File Line Suppression State
Error LNK2019 unresolved external symbol "public: __cdecl
boost::thread::thread(void)" (??0thread@boost@@QEAA@XZ) referenced in
function "public: __cdecl pcl::TimeTrigger::TimeTrigger(double,class
boost::function<void __cdecl(void)> const &)"
(??0TimeTrigger@pcl@@QEAA@NAEBV?$function@$$A6AXXZ@boost@@@Z) pcl_common
C:\PCL\pcl-master\build\common\time_trigger.obj 1


Severity Code Description Project File Line Suppression State
Error C1189 #error:  Xiron Platform Abstraction Layer - Win32 - Microsoft
Visual Studio versions above 2010 (10.0) are not supported! pcl_io
c:\program files\openni\include\XnPlatform.h 58


Severity Code Description Project File Line Suppression State
Error C2065 'ssize_t': undeclared identifier pcl_io
C:\PCL\pcl-master\io\src\pcd_io.cpp 765


Severity Code Description Project File Line Suppression State
Error C2146 syntax error: missing ';' before identifier 'num_read' pcl_io
C:\PCL\pcl-master\io\src\pcd_io.cpp 765


Severity Code Description Project File Line Suppression State
Error C1189 #error:  Xiron Platform Abstraction Layer - Win32 - Microsoft
Visual Studio versions above 2010 (10.0) are not supported! pcl_io
c:\program files\openni\include\XnPlatform.h 58


Severity Code Description Project File Line Suppression State
Error C2280 'Eigen::Block<Derived,-1,-1,false,true>
&Eigen::Block<Derived,-1,-1,false,true>::operator =(const
Eigen::Block<Derived,-1,-1,false,true> &)': attempting to reference a
deleted function pcl_gpu_kinfu c:\program files
(x86)\eigen\include\eigen\src\Core\SolveTriangular.h 194


Severity Code Description Project File Line Suppression State
Error MSB8020 The build tools for v141 (Platform Toolset = 'v141') cannot be
found. To build using the v141 build tools, please install v141 build tools.
Alternatively, you may upgrade to the current Visual Studio tools by
selecting the Project menu or right-click the solution, and then selecting
"Retarget solution". pcl_voxel_grid_occlusion_estimation C:\Program Files
(x86)\MSBuild\Microsoft.Cpp\v4.0\V140\Microsoft.Cpp.Platform.targets 57

--
Sent from: http://www.pcl-users.org/
_______________________________________________
PCL-users@pointclouds.org / http://pointclouds.org
http://pointclouds.org/mailman/listinfo/pcl-users
Reply | Threaded
Open this post in threaded view
|

Re: GPU includes not found

nigellima
A summary of my problem:

I first installed PCL using the All-in-one installer of the version 1.6 to
use the code example of people_pcd_prob.cpp and include in my own project
later.
The, I noticed that gpu features were not included in this version, so I
installed 1.8 all-in-one installer. I tried then to build the example code
with Cmake, but it couldnt find the includes for gpu/ functions. So,
Goldesel told me to build the library from source.
I installed then the standalone dependencies and download the 1.8 version of
PCL from Github. I followed all the steps in the tutorial to install from
build source. My first shot was with Visual Studio 2015, some errors were
occurring and I tried later to re-do the steps with Visual Studio 2017, it
didnt work either. Finally, I tried with visual studio 10, which was the
version used in the tutorial. Some of the builds succeed, around 27, but
over 160 build failed. I checked in the bin most of the important libraries
were not compiled.
Also, in the Cmake environment, I checked all the input boxes for CUDA and
GPU features. By the way, I have the CUDA 8 driver installed in my computer.

I really dont have any clue of what to do to get it working. Is there any
chance that this sequence of installations might have messed up with my
dependencies? What am I doing worong?

I appreciate any help. Thanks in advance



--
Sent from: http://www.pcl-users.org/
_______________________________________________
[hidden email] / http://pointclouds.org
http://pointclouds.org/mailman/listinfo/pcl-users
Reply | Threaded
Open this post in threaded view
|

Re: GPU includes not found

nigellima
This post was updated on .
Now, I've uninstalled all the dependencies that were in 32 and 63 bits and
reinstalled the standalone dependencies for 64 bits. In the beginning of the
installation I've got the following log:

the file
'C:/PCL/cuda/io/CMakeFiles/pcl_cuda_io.dir/src/pcl_cuda_io_generated_disparity_to_cloud.cu.obj.depend'
1>    is newer than 'C:/PCL/cuda/io/CMakeFiles/generate.stamp.depend'
1>    result='-1'
1>  -- Could NOT find PkgConfig (missing:  PKG_CONFIG_EXECUTABLE)
1>  -- Found OpenMP
1>  -- Eigen found (include: C:/Program Files (x86)/Eigen/include, version:
3.0.5)
1>  -- FLANN found (include: C:/Program Files/flann/include, lib:
optimized;C:/Program Files/flann/lib/flann_cpp_s.lib;debug;C:/Program
Files/flann/lib/flann_cpp_s-gd.lib)
1>  -- Could NOT find LIBUSB_1 (missing:  LIBUSB_1_LIBRARY
LIBUSB_1_INCLUDE_DIR)
1>  -- OpenNI found (include: C:/Program Files/OpenNI/Include, lib:
C:/Program Files/OpenNI/Lib64/openNI64.lib)
1>  -- Could NOT find ZLIB (missing:  ZLIB_LIBRARY ZLIB_INCLUDE_DIR)
1>  -- Could NOT find PNG (missing:  PNG_LIBRARY PNG_PNG_INCLUDE_DIR)
1>  -- QHULL found (include: C:/Program Files/qhull/include, lib:
optimized;C:/Program Files/qhull/lib/qhullstatic.lib;debug;C:/Program
Files/qhull/lib/qhullstatic_d.lib)
1>  -- Found CUDA Toolkit v8.0
1>  -- CUDA NVCC target flags:
-gencode;arch=compute_20,code=sm_20;-gencode;arch=compute_20,code=sm_21;-gencode;arch=compute_30,code=sm_30;-gencode;arch=compute_35,code=sm_35;-gencode;arch=compute_50,code=sm_50;-gencode;arch=compute_52,code=sm_52;-gencode;arch=compute_53,code=sm_53;-gencode;arch=compute_60,code=sm_60;-gencode;arch=compute_61,code=sm_61
1>  -- VTK_MAJOR_VERSION 5, rendering backend: OpenGL
1>  -- Could NOT find QVTK (missing:  QVTK_LIBRARY QVTK_INCLUDE_DIR)
1>  -- VTK found (include: C:/Program Files/VTK 5.8.0/include/vtk-5.8, lib:
C:/Program Files/VTK 5.8.0/lib/vtk-5.8)
1>  -- Could NOT find PCAP (missing:  PCAP_LIBRARIES PCAP_INCLUDE_DIRS)
1>  -- Boost version: 1.50.0
1>  -- Found the following Boost libraries:
1>  --   system
1>  --   filesystem
1>  --   thread
1>  --   date_time
1>  --   iostreams
1>  --   chrono
1>  --   regex
1>  -- VTK found (include: C:/Program Files/VTK 5.8.0/include/vtk-5.8, lib:
C:/Program Files/VTK 5.8.0/lib/vtk-5.8)
1>  -- PCL_EXAMPLES_SUBDIRS
C:/PCL/pcl-master/examples/common/;C:/PCL/pcl-master/examples/features/;C:/PCL/pcl-master/examples/filters/;C:/PCL/pcl-master/examples/geometry/;C:/PCL/pcl-master/examples/keypoints/;C:/PCL/pcl-master/examples/outofcore/;C:/PCL/pcl-master/examples/segmentation/;C:/PCL/pcl-master/examples/stereo/;C:/PCL/pcl-master/examples/surface/
1>  -- DOXYGEN_FOUND
1>  -- HTML_HELP_COMPILER
1>  -- Found CPack generators: NSIS
1>  -- The following subsystems will be built:
1>  --   common
1>  --   octree
1>  --   io
1>  --   kdtree
1>  --   search
1>  --   sample_consensus
1>  --   filters
1>  --   2d
1>  --   geometry
1>  --   features
1>  --   ml
1>  --   segmentation
1>  --   visualization
1>  --   surface
1>  --   registration
1>  --   keypoints
1>  --   tracking
1>  --   recognition
1>  --   stereo
1>  --   cuda_common
1>  --   cuda_io
1>  --   cuda_features
1>  --   cuda_segmentation
1>  --   cuda_sample_consensus
1>  --   cuda_apps
1>  --   outofcore
1>  --   examples
1>  --   gpu_containers
1>  --   gpu_utils
1>  --   gpu_octree
1>  --   gpu_features
1>  --   gpu_kinfu
1>  --   gpu_kinfu_large_scale
1>  --   gpu_people
1>  --   gpu_segmentation
1>  --   gpu_surface
1>  --   gpu_tracking
1>  --   people
1>  --   tools
1>  -- The following subsystems will not be built:
1>  --   apps: No reason
1>  --   simulation: Disabled by default.
1>  --   global_tests: No reason
1>  -- Configuring done

the builds that succeed incresead to 40 and around 140 failed. All the fatal
errors are like these:

107>LINK : fatal error LNK1104: cannot open file
'..\lib\pcl_visualization_debug.lib'
107>
107>Build FAILED.

108>LINK : fatal error LNK1104: cannot open file '..\lib\pcl_io_debug.lib'
108>
108>Build FAILED.

105>LINK : fatal error LNK1104: cannot open file
'..\lib\pcl_visualization_debug.lib'
105>
105>Build FAILED.



--
Sent from: http://www.pcl-users.org/
_______________________________________________
PCL-users@pointclouds.org / http://pointclouds.org
http://pointclouds.org/mailman/listinfo/pcl-users
Reply | Threaded
Open this post in threaded view
|

Re: GPU includes not found

Goldesel
I did not build using vs2017. I used 2015 version in Windows. I found some problems and was only able to build no building the global tests and not using the UMFPACK. In Cuda make sure you have 64-bit code enabled and select the correct compute capability of your nvidia card. 

Em ter, 3 de out de 2017 às 01:22, nigellima <[hidden email]> escreveu:
Now, I've installed all the dependencies that were in 32 and 63 bits and
reinstalled the standalone dependencies for 64 bits. In the beginning of the
installation I've got the following log:

the file
'C:/PCL/cuda/io/CMakeFiles/pcl_cuda_io.dir/src/pcl_cuda_io_generated_disparity_to_cloud.cu.obj.depend'
1>    is newer than 'C:/PCL/cuda/io/CMakeFiles/generate.stamp.depend'
1>    result='-1'
1>  -- Could NOT find PkgConfig (missing:  PKG_CONFIG_EXECUTABLE)
1>  -- Found OpenMP
1>  -- Eigen found (include: C:/Program Files (x86)/Eigen/include, version:
3.0.5)
1>  -- FLANN found (include: C:/Program Files/flann/include, lib:
optimized;C:/Program Files/flann/lib/flann_cpp_s.lib;debug;C:/Program
Files/flann/lib/flann_cpp_s-gd.lib)
1>  -- Could NOT find LIBUSB_1 (missing:  LIBUSB_1_LIBRARY
LIBUSB_1_INCLUDE_DIR)
1>  -- OpenNI found (include: C:/Program Files/OpenNI/Include, lib:
C:/Program Files/OpenNI/Lib64/openNI64.lib)
1>  -- Could NOT find ZLIB (missing:  ZLIB_LIBRARY ZLIB_INCLUDE_DIR)
1>  -- Could NOT find PNG (missing:  PNG_LIBRARY PNG_PNG_INCLUDE_DIR)
1>  -- QHULL found (include: C:/Program Files/qhull/include, lib:
optimized;C:/Program Files/qhull/lib/qhullstatic.lib;debug;C:/Program
Files/qhull/lib/qhullstatic_d.lib)
1>  -- Found CUDA Toolkit v8.0
1>  -- CUDA NVCC target flags:
-gencode;arch=compute_20,code=sm_20;-gencode;arch=compute_20,code=sm_21;-gencode;arch=compute_30,code=sm_30;-gencode;arch=compute_35,code=sm_35;-gencode;arch=compute_50,code=sm_50;-gencode;arch=compute_52,code=sm_52;-gencode;arch=compute_53,code=sm_53;-gencode;arch=compute_60,code=sm_60;-gencode;arch=compute_61,code=sm_61
1>  -- VTK_MAJOR_VERSION 5, rendering backend: OpenGL
1>  -- Could NOT find QVTK (missing:  QVTK_LIBRARY QVTK_INCLUDE_DIR)
1>  -- VTK found (include: C:/Program Files/VTK 5.8.0/include/vtk-5.8, lib:
C:/Program Files/VTK 5.8.0/lib/vtk-5.8)
1>  -- Could NOT find PCAP (missing:  PCAP_LIBRARIES PCAP_INCLUDE_DIRS)
1>  -- Boost version: 1.50.0
1>  -- Found the following Boost libraries:
1>  --   system
1>  --   filesystem
1>  --   thread
1>  --   date_time
1>  --   iostreams
1>  --   chrono
1>  --   regex
1>  -- VTK found (include: C:/Program Files/VTK 5.8.0/include/vtk-5.8, lib:
C:/Program Files/VTK 5.8.0/lib/vtk-5.8)
1>  -- PCL_EXAMPLES_SUBDIRS
C:/PCL/pcl-master/examples/common/;C:/PCL/pcl-master/examples/features/;C:/PCL/pcl-master/examples/filters/;C:/PCL/pcl-master/examples/geometry/;C:/PCL/pcl-master/examples/keypoints/;C:/PCL/pcl-master/examples/outofcore/;C:/PCL/pcl-master/examples/segmentation/;C:/PCL/pcl-master/examples/stereo/;C:/PCL/pcl-master/examples/surface/
1>  -- DOXYGEN_FOUND
1>  -- HTML_HELP_COMPILER
1>  -- Found CPack generators: NSIS
1>  -- The following subsystems will be built:
1>  --   common
1>  --   octree
1>  --   io
1>  --   kdtree
1>  --   search
1>  --   sample_consensus
1>  --   filters
1>  --   2d
1>  --   geometry
1>  --   features
1>  --   ml
1>  --   segmentation
1>  --   visualization
1>  --   surface
1>  --   registration
1>  --   keypoints
1>  --   tracking
1>  --   recognition
1>  --   stereo
1>  --   cuda_common
1>  --   cuda_io
1>  --   cuda_features
1>  --   cuda_segmentation
1>  --   cuda_sample_consensus
1>  --   cuda_apps
1>  --   outofcore
1>  --   examples
1>  --   gpu_containers
1>  --   gpu_utils
1>  --   gpu_octree
1>  --   gpu_features
1>  --   gpu_kinfu
1>  --   gpu_kinfu_large_scale
1>  --   gpu_people
1>  --   gpu_segmentation
1>  --   gpu_surface
1>  --   gpu_tracking
1>  --   people
1>  --   tools
1>  -- The following subsystems will not be built:
1>  --   apps: No reason
1>  --   simulation: Disabled by default.
1>  --   global_tests: No reason
1>  -- Configuring done

the builds that succeed incresead to 40 and around 140 failed. All the fatal
errors are like these:

107>LINK : fatal error LNK1104: cannot open file
'..\lib\pcl_visualization_debug.lib'
107>
107>Build FAILED.

108>LINK : fatal error LNK1104: cannot open file '..\lib\pcl_io_debug.lib'
108>
108>Build FAILED.

105>LINK : fatal error LNK1104: cannot open file
'..\lib\pcl_visualization_debug.lib'
105>
105>Build FAILED.



--
Sent from: http://www.pcl-users.org/
_______________________________________________
[hidden email] / http://pointclouds.org
http://pointclouds.org/mailman/listinfo/pcl-users

_______________________________________________
[hidden email] / http://pointclouds.org
http://pointclouds.org/mailman/listinfo/pcl-users