Error running first program in ubuntu 16.04

classic Classic list List threaded Threaded
2 messages Options
MB
Reply | Threaded
Open this post in threaded view
|

Error running first program in ubuntu 16.04

MB
undefined reference to `inflateValidate@ZLIB_1.2.9'
collect2: error: ld returned 1 exit status
CMakeFiles/pcd_write_test.dir/build.make:249: recipe for target
'pcd_write_test' failed
make[2]: *** [pcd_write_test] Error 1
CMakeFiles/Makefile2:67: recipe for target
'CMakeFiles/pcd_write_test.dir/all' failed
make[1]: *** [CMakeFiles/pcd_write_test.dir/all] Error 2
Makefile:83: recipe for target 'all' failed
make: *** [all] Error 2



I am new to this...How to sort it out ???



--
Sent from: http://www.pcl-users.org/
_______________________________________________
[hidden email] / http://pointclouds.org
http://pointclouds.org/mailman/listinfo/pcl-users
Reply | Threaded
Open this post in threaded view
|

Re: Error running first program in ubuntu 16.04

Sérgio Agostinho
So I would recommend to upload your CMakeLists.txt file somewhere first.
Your error just mean you're not linking properly to zlib! Probably
nothing to do with PCL...

Cheers




_______________________________________________
[hidden email] / http://pointclouds.org
http://pointclouds.org/mailman/listinfo/pcl-users

signature.asc (836 bytes) Download Attachment